*Heading
 Cantilever job tutorial
** Job name: Deform Model name: Model-1
*Preprint, echo=NO, model=NO, history=NO, contact=NO
**
** PARTS
**
*Part, name=beam
*End Part
**
** ASSEMBLY
**
*Assembly, name=Assembly
**
*Instance, name=beam-1, part=beam
*Node
*Element, type=C3D8I
** Region: (Section-1:Picked)
*Elset, elset=_PickedSet2, internal, generate
** Section: Section-1
*Solid Section, elset=_PickedSet2, material=steel
1.,
*End Instance
*Nset, nset=_PickedSet4, internal, instance=beam-1, generate
*Elset, elset=_PickedSet4, internal, instance=beam-1, generate
*Elset, elset=__PickedSurf5_S6, internal, instance=beam-1, generate
*Surface, type=ELEMENT, name=_PickedSurf5, internal
__PickedSurf5_S6, S6
*End Assembly
**
** MATERIALS
**
*Material, name=steel
*Elastic
209000., 0.3
** ----------------------------------------------------------------
**
** STEP: Beamload
**
*Step, name=Beamload
Load the top of the beam
*Static
1., 1., 1e-05, 1.
**
** BOUNDARY CONDITIONS
**
** Name: fixed Type: Symmetry/Antisymmetry/Encastre
*Boundary
_PickedSet4, ENCASTRE
**
** LOADS
**
** Name: Load-1   Type: Pressure
*Dsload
_PickedSurf5, P, 0.5
**
** OUTPUT REQUESTS
**
*Restart, write, frequency=1
**
** FIELD OUTPUT: F-Output-1
**
*Output, field, variable=PRESELECT
**
** HISTORY OUTPUT: H-Output-1
**
*Output, history, variable=PRESELECT
*El Print, freq=999999
*Node Print, freq=999999
*End Step